{"text_format":"1","workbook":"xlsx","n_sheets":6,"sheets":["記入上の注意（必ずお読みください）","申込一覧","リレー","競技者","ﾘﾚｰDB","名前"],"not_rendered":{"charts":0,"images":2,"macros":1,"external_links":0,"defined_names":10,"comments":0,"pivot_tables":0},"unopened":[],"bounds":{"document_bytes":16777216,"sheet_cells":100000,"rows_first":2000,"rows_last":500,"rows_between":2000,"halvings":0,"cell_chars":16384,"cell_head_chars":4096},"cells_cut":0,"cells_raw":0,"read":"whole","date_system":"1900"}

{"sheet":"記入上の注意（必ずお読みください）","index":0,"n_rows":22,"n_cols":2,"rows_kept":22,"cut":false,"hidden":false,"merged":[[0,0,0,1]]}
["記入上の注意（必ずお読みください）"]
[]
["【1】","本大会専用の申込みファイルであることを確認してください。"]
[null,"　　　この申込みファイルは「徳島県小学生短距離記録会」です。"]
["【2】","ファイル名を校名や団体名に変更してください。"]
["【3】","色のついたセルにのみ入力してください。"]
["【4】","例にならって記入してください。"]
[null,"最高記録は「秒」や「m」「．」などの単位は入力しないでください。"]
[null,"ナンバーの「－」ハイフンは省いて入力してください。"]
[null,"記録がない場合は空白でお願いします。"]
[]
[]
[]
[null,"※他のデータからコピーする場合は、「形式を選択して貼付→値」でお願いします。"]
[]
["【5】","「 都道府県 」「 種別 」「 性別 」「 種目 」はプルダウンから選択してください。"]
[null,"他の試合のデータとは選択が異なります。貼付せずに選択をお願いします。"]
["【6】","ファイルを保存して、藤内　則康(下記アドレス） 宛へ送信してください。"]
[null,"メールアドレス　：　tksmjrtf@yahoo.co.jp"]
["【7】","受付時点で、その旨、返信いたします。受付返信がない場合は、至急下記へご連絡ください。"]
[null,"その他、入力等の不明な点は、必ずチーム監督を通して、下記までご連絡ください。"]
[null,"東みよしＴＦ　　藤内　則康　まで"]

{"sheet":"申込一覧","index":1,"n_rows":99,"n_cols":16,"rows_kept":99,"cut":false,"hidden":false,"merged":[[16,3,16,4],[16,5,16,6],[16,7,16,8],[14,3,14,4],[14,5,14,6],[14,7,14,8],[15,3,15,4],[15,5,15,6],[15,7,15,8],[12,3,12,4],[12,5,12,6],[12,7,12,8],[13,3,13,4],[13,5,13,6],[13,7,13,8],[8,0,8,1],[8,2,8,4],[8,5,8,6],[8,7,8,11],[10,3,10,4],[10,5,10,7],[10,9,10,10],[0,0,0,11],[2,9,2,11],[4,0,4,10],[5,0,5,10],[7,0,7,1],[7,2,7,6],[7,7,7,8],[7,9,7,11]]}
["徳島県小学生短距離記録会　参加申込み一覧表"]
[]
[null,null,null,null,null,null,null,null,null,{"$f":"TODAY()","v":"2022-05-30"}]
[]
["　徳島陸上競技協会長　殿"]
["　大会要項により，参加料を添えて標記大会に参加申し込みをいたします。"]
[]
["所 属 名",null,null,null,null,null,null,"所   属   長"]
["申込責任者",null,null,null,null,"緊急連絡先\n（申込者の携帯電話）"]
[]
[null,"都道\n府県",null,"所属名略称",null,null,null,null,"種   別","小学"]
[]
[null,null,null,"男子",null,"女子",null,"計",null,"個人",{"$f":"IF(J11=\"\",\"\",INDEX(名前!$G$18:$G$21,MATCH(申込一覧!J11,種別,0)))","v":600}]
[null,null,"参加人数",{"$f":"COUNTIF($F$20:$F$99,1)","v":0},null,{"$f":"COUNTIF($F$20:$F$99,2)","v":0},null,{"$f":"SUM(D14:G14)","v":0}]
[null,null,"個人種目数",{"$f":"COUNTIF($G$20:$G$99:$I$20:$I$99:$K$20:$K$99,\"男\"&\"*\")","v":0},null,{"$f":"COUNTIF($G$20:$G$99:$I$20:$I$99:$K$20:$K$99,\"女\"&\"*\")","v":0},null,{"$f":"SUM(D15:G15)","v":0}]
[null,null,"リレー種目数",{"$f":"COUNTIF(リレー!$A$11:$A$25,\"男\"&\"*\")","v":0},null,{"$f":"COUNTIF(リレー!$A$11:$A$25,\"女\"&\"*\")","v":0},null,{"$f":"SUM(D16:G16)","v":0}]
[null,null,"参加料合計",{"$f":"IF(J11=\"\",\"\",$D$15*$K$13+$D$16*$K$14)","v":0},null,{"$f":"IF(J11=\"\",\"\",$F$15*$K$13+$F$16*$K$14)","v":0},null,{"$f":"SUM(D17:G17)","v":0}]
[]
["№","ﾅﾝﾊﾞｰ","氏　名","ﾌﾘｶﾞﾅ","年","性","種目1","最高記録","種目2","最高記録","種目3","最高記録"]
[1,null,null,null,null,null,null,null,null,null,null,null,null,{"$f":"IF(G20=\"\",\"\",INDEX(名前!$N$4:$N$47,MATCH(申込一覧!G20,名前!$M$4:$M$47,0)))","v":""},{"$f":"IF(I20=\"\",\"\",INDEX(名前!$N$4:$N$47,MATCH(申込一覧!I20,名前!$M$4:$M$47,0)))","v":""},{"$f":"IF(K20=\"\",\"\",INDEX(名前!$N$4:$N$47,MATCH(申込一覧!K20,名前!$M$4:$M$47,0)))","v":""}]
[2,null,null,null,null,null,null,null,null,null,null,null,null,{"$f":"IF(G21=\"\",\"\",INDEX(名前!$N$4:$N$47,MATCH(申込一覧!G21,名前!$M$4:$M$47,0)))","v":""},{"$f":"IF(I21=\"\",\"\",INDEX(名前!$N$4:$N$47,MATCH(申込一覧!I21,名前!$M$4:$M$47,0)))","v":""},{"$f":"IF(K21=\"\",\"\",INDEX(名前!$N$4:$N$47,MATCH(申込一覧!K21,名前!$M$4:$M$47,0)))","v":""}]
[3,null,null,null,null,null,null,null,null,null,null,null,null,{"$f":"IF(G22=\"\",\"\",INDEX(名前!$N$4:$N$47,MATCH(申込一覧!G22,名前!$M$4:$M$47,0)))","v":""},{"$f":"IF(I22=\"\",\"\",INDEX(名前!$N$4:$N$47,MATCH(申込一覧!I22,名前!$M$4:$M$47,0)))","v":""},{"$f":"IF(K22=\"\",\"\",INDEX(名前!$N$4:$N$47,MATCH(申込一覧!K22,名前!$M$4:$M$47,0)))","v":""}]
[4,null,null,null,null,null,null,null,null,null,null,null,null,{"$f":"IF(G23=\"\",\"\",INDEX(名前!$N$4:$N$47,MATCH(申込一覧!G23,名前!$M$4:$M$47,0)))","v":""},{"$f":"IF(I23=\"\",\"\",INDEX(名前!$N$4:$N$47,MATCH(申込一覧!I23,名前!$M$4:$M$47,0)))","v":""},{"$f":"IF(K23=\"\",\"\",INDEX(名前!$N$4:$N$47,MATCH(申込一覧!K23,名前!$M$4:$M$47,0)))","v":""}]
[5,null,null,null,null,null,null,null,null,null,null,null,null,{"$f":"IF(G24=\"\",\"\",INDEX(名前!$N$4:$N$47,MATCH(申込一覧!G24,名前!$M$4:$M$47,0)))","v":""},{"$f":"IF(I24=\"\",\"\",INDEX(名前!$N$4:$N$47,MATCH(申込一覧!I24,名前!$M$4:$M$47,0)))","v":""},{"$f":"IF(K24=\"\",\"\",INDEX(名前!$N$4:$N$47,MATCH(申込一覧!K24,名前!$M$4:$M$47,0)))","v":""}]
[6,null,null,null,null,null,null,null,null,null,null,null,null,{"$f":"IF(G25=\"\",\"\",INDEX(名前!$N$4:$N$47,MATCH(申込一覧!G25,名前!$M$4:$M$47,0)))","v":""},{"$f":"IF(I25=\"\",\"\",INDEX(名前!$N$4:$N$47,MATCH(申込一覧!I25,名前!$M$4:$M$47,0)))","v":""},{"$f":"IF(K25=\"\",\"\",INDEX(名前!$N$4:$N$47,MATCH(申込一覧!K25,名前!$M$4:$M$47,0)))","v":""}]
[7,null,null,null,null,null,null,null,null,null,null,null,null,{"$f":"IF(G26=\"\",\"\",INDEX(名前!$N$4:$N$47,MATCH(申込一覧!G26,名前!$M$4:$M$47,0)))","v":""},{"$f":"IF(I26=\"\",\"\",INDEX(名前!$N$4:$N$47,MATCH(申込一覧!I26,名前!$M$4:$M$47,0)))","v":""},{"$f":"IF(K26=\"\",\"\",INDEX(名前!$N$4:$N$47,MATCH(申込一覧!K26,名前!$M$4:$M$47,0)))","v":""}]
[8,null,null,null,null,null,null,null,null,null,null,null,null,{"$f":"IF(G27=\"\",\"\",INDEX(名前!$N$4:$N$47,MATCH(申込一覧!G27,名前!$M$4:$M$47,0)))","v":""},{"$f":"IF(I27=\"\",\"\",INDEX(名前!$N$4:$N$47,MATCH(申込一覧!I27,名前!$M$4:$M$47,0)))","v":""},{"$f":"IF(K27=\"\",\"\",INDEX(名前!$N$4:$N$47,MATCH(申込一覧!K27,名前!$M$4:$M$47,0)))","v":""}]
[9,null,null,null,null,null,null,null,null,null,null,null,null,{"$f":"IF(G28=\"\",\"\",INDEX(名前!$N$4:$N$47,MATCH(申込一覧!G28,名前!$M$4:$M$47,0)))","v":""},{"$f":"IF(I28=\"\",\"\",INDEX(名前!$N$4:$N$47,MATCH(申込一覧!I28,名前!$M$4:$M$47,0)))","v":""},{"$f":"IF(K28=\"\",\"\",INDEX(名前!$N$4:$N$47,MATCH(申込一覧!K28,名前!$M$4:$M$47,0)))","v":""}]
[10,null,null,null,null,null,null,null,null,null,null,null,null,{"$f":"IF(G29=\"\",\"\",INDEX(名前!$N$4:$N$47,MATCH(申込一覧!G29,名前!$M$4:$M$47,0)))","v":""},{"$f":"IF(I29=\"\",\"\",INDEX(名前!$N$4:$N$47,MATCH(申込一覧!I29,名前!$M$4:$M$47,0)))","v":""},{"$f":"IF(K29=\"\",\"\",INDEX(名前!$N$4:$N$47,MATCH(申込一覧!K29,名前!$M$4:$M$47,0)))","v":""}]
[11,null,null,null,null,null,null,null,null,null,null,null,null,{"$f":"IF(G30=\"\",\"\",INDEX(名前!$N$4:$N$47,MATCH(申込一覧!G30,名前!$M$4:$M$47,0)))","v":""},{"$f":"IF(I30=\"\",\"\",INDEX(名前!$N$4:$N$47,MATCH(申込一覧!I30,名前!$M$4:$M$47,0)))","v":""},{"$f":"IF(K30=\"\",\"\",INDEX(名前!$N$4:$N$47,MATCH(申込一覧!K30,名前!$M$4:$M$47,0)))","v":""}]
[12,null,null,null,null,null,null,null,null,null,null,null,null,{"$f":"IF(G31=\"\",\"\",INDEX(名前!$N$4:$N$47,MATCH(申込一覧!G31,名前!$M$4:$M$47,0)))","v":""},{"$f":"IF(I31=\"\",\"\",INDEX(名前!$N$4:$N$47,MATCH(申込一覧!I31,名前!$M$4:$M$47,0)))","v":""},{"$f":"IF(K31=\"\",\"\",INDEX(名前!$N$4:$N$47,MATCH(申込一覧!K31,名前!$M$4:$M$47,0)))","v":""}]
[13,null,null,null,null,null,null,null,null,null,null,null,null,{"$f":"IF(G32=\"\",\"\",INDEX(名前!$N$4:$N$47,MATCH(申込一覧!G32,名前!$M$4:$M$47,0)))","v":""},{"$f":"IF(I32=\"\",\"\",INDEX(名前!$N$4:$N$47,MATCH(申込一覧!I32,名前!$M$4:$M$47,0)))","v":""},{"$f":"IF(K32=\"\",\"\",INDEX(名前!$N$4:$N$47,MATCH(申込一覧!K32,名前!$M$4:$M$47,0)))","v":""}]
[14,null,null,null,null,null,null,null,null,null,null,null,null,{"$f":"IF(G33=\"\",\"\",INDEX(名前!$N$4:$N$47,MATCH(申込一覧!G33,名前!$M$4:$M$47,0)))","v":""},{"$f":"IF(I33=\"\",\"\",INDEX(名前!$N$4:$N$47,MATCH(申込一覧!I33,名前!$M$4:$M$47,0)))","v":""},{"$f":"IF(K33=\"\",\"\",INDEX(名前!$N$4:$N$47,MATCH(申込一覧!K33,名前!$M$4:$M$47,0)))","v":""}]
[15,null,null,null,null,null,null,null,null,null,null,null,null,{"$f":"IF(G34=\"\",\"\",INDEX(名前!$N$4:$N$47,MATCH(申込一覧!G34,名前!$M$4:$M$47,0)))","v":""},{"$f":"IF(I34=\"\",\"\",INDEX(名前!$N$4:$N$47,MATCH(申込一覧!I34,名前!$M$4:$M$47,0)))","v":""},{"$f":"IF(K34=\"\",\"\",INDEX(名前!$N$4:$N$47,MATCH(申込一覧!K34,名前!$M$4:$M$47,0)))","v":""}]
[16,null,null,null,null,null,null,null,null,null,null,null,null,{"$f":"IF(G35=\"\",\"\",INDEX(名前!$N$4:$N$47,MATCH(申込一覧!G35,名前!$M$4:$M$47,0)))","v":""},{"$f":"IF(I35=\"\",\"\",INDEX(名前!$N$4:$N$47,MATCH(申込一覧!I35,名前!$M$4:$M$47,0)))","v":""},{"$f":"IF(K35=\"\",\"\",INDEX(名前!$N$4:$N$47,MATCH(申込一覧!K35,名前!$M$4:$M$47,0)))","v":""}]
[17,null,null,null,null,null,null,null,null,null,null,null,null,{"$f":"IF(G36=\"\",\"\",INDEX(名前!$N$4:$N$47,MATCH(申込一覧!G36,名前!$M$4:$M$47,0)))","v":""},{"$f":"IF(I36=\"\",\"\",INDEX(名前!$N$4:$N$47,MATCH(申込一覧!I36,名前!$M$4:$M$47,0)))","v":""},{"$f":"IF(K36=\"\",\"\",INDEX(名前!$N$4:$N$47,MATCH(申込一覧!K36,名前!$M$4:$M$47,0)))","v":""}]
[18,null,null,null,null,null,null,null,null,null,null,null,null,{"$f":"IF(G37=\"\",\"\",INDEX(名前!$N$4:$N$47,MATCH(申込一覧!G37,名前!$M$4:$M$47,0)))","v":""},{"$f":"IF(I37=\"\",\"\",INDEX(名前!$N$4:$N$47,MATCH(申込一覧!I37,名前!$M$4:$M$47,0)))","v":""},{"$f":"IF(K37=\"\",\"\",INDEX(名前!$N$4:$N$47,MATCH(申込一覧!K37,名前!$M$4:$M$47,0)))","v":""}]
[19,null,null,null,null,null,null,null,null,null,null,null,null,{"$f":"IF(G38=\"\",\"\",INDEX(名前!$N$4:$N$47,MATCH(申込一覧!G38,名前!$M$4:$M$47,0)))","v":""},{"$f":"IF(I38=\"\",\"\",INDEX(名前!$N$4:$N$47,MATCH(申込一覧!I38,名前!$M$4:$M$47,0)))","v":""},{"$f":"IF(K38=\"\",\"\",INDEX(名前!$N$4:$N$47,MATCH(申込一覧!K38,名前!$M$4:$M$47,0)))","v":""}]
[20,null,null,null,null,null,null,null,null,null,null,null,null,{"$f":"IF(G39=\"\",\"\",INDEX(名前!$N$4:$N$47,MATCH(申込一覧!G39,名前!$M$4:$M$47,0)))","v":""},{"$f":"IF(I39=\"\",\"\",INDEX(名前!$N$4:$N$47,MATCH(申込一覧!I39,名前!$M$4:$M$47,0)))","v":""},{"$f":"IF(K39=\"\",\"\",INDEX(名前!$N$4:$N$47,MATCH(申込一覧!K39,名前!$M$4:$M$47,0)))","v":""}]
[21,null,null,null,null,null,null,null,null,null,null,null,null,{"$f":"IF(G40=\"\",\"\",INDEX(名前!$N$4:$N$47,MATCH(申込一覧!G40,名前!$M$4:$M$47,0)))","v":""},{"$f":"IF(I40=\"\",\"\",INDEX(名前!$N$4:$N$47,MATCH(申込一覧!I40,名前!$M$4:$M$47,0)))","v":""},{"$f":"IF(K40=\"\",\"\",INDEX(名前!$N$4:$N$47,MATCH(申込一覧!K40,名前!$M$4:$M$47,0)))","v":""}]
[22,null,null,null,null,null,null,null,null,null,null,null,null,{"$f":"IF(G41=\"\",\"\",INDEX(名前!$N$4:$N$47,MATCH(申込一覧!G41,名前!$M$4:$M$47,0)))","v":""},{"$f":"IF(I41=\"\",\"\",INDEX(名前!$N$4:$N$47,MATCH(申込一覧!I41,名前!$M$4:$M$47,0)))","v":""},{"$f":"IF(K41=\"\",\"\",INDEX(名前!$N$4:$N$47,MATCH(申込一覧!K41,名前!$M$4:$M$47,0)))","v":""}]
[23,null,null,null,null,null,null,null,null,null,null,null,null,{"$f":"IF(G42=\"\",\"\",INDEX(名前!$N$4:$N$47,MATCH(申込一覧!G42,名前!$M$4:$M$47,0)))","v":""},{"$f":"IF(I42=\"\",\"\",INDEX(名前!$N$4:$N$47,MATCH(申込一覧!I42,名前!$M$4:$M$47,0)))","v":""},{"$f":"IF(K42=\"\",\"\",INDEX(名前!$N$4:$N$47,MATCH(申込一覧!K42,名前!$M$4:$M$47,0)))","v":""}]
[24,null,null,null,null,null,null,null,null,null,null,null,null,{"$f":"IF(G43=\"\",\"\",INDEX(名前!$N$4:$N$47,MATCH(申込一覧!G43,名前!$M$4:$M$47,0)))","v":""},{"$f":"IF(I43=\"\",\"\",INDEX(名前!$N$4:$N$47,MATCH(申込一覧!I43,名前!$M$4:$M$47,0)))","v":""},{"$f":"IF(K43=\"\",\"\",INDEX(名前!$N$4:$N$47,MATCH(申込一覧!K43,名前!$M$4:$M$47,0)))","v":""}]
[25,null,null,null,null,null,null,null,null,null,null,null,null,{"$f":"IF(G44=\"\",\"\",INDEX(名前!$N$4:$N$47,MATCH(申込一覧!G44,名前!$M$4:$M$47,0)))","v":""},{"$f":"IF(I44=\"\",\"\",INDEX(名前!$N$4:$N$47,MATCH(申込一覧!I44,名前!$M$4:$M$47,0)))","v":""},{"$f":"IF(K44=\"\",\"\",INDEX(名前!$N$4:$N$47,MATCH(申込一覧!K44,名前!$M$4:$M$47,0)))","v":""}]
[26,null,null,null,null,null,null,null,null,null,null,null,null,{"$f":"IF(G45=\"\",\"\",INDEX(名前!$N$4:$N$47,MATCH(申込一覧!G45,名前!$M$4:$M$47,0)))","v":""},{"$f":"IF(I45=\"\",\"\",INDEX(名前!$N$4:$N$47,MATCH(申込一覧!I45,名前!$M$4:$M$47,0)))","v":""},{"$f":"IF(K45=\"\",\"\",INDEX(名前!$N$4:$N$47,MATCH(申込一覧!K45,名前!$M$4:$M$47,0)))","v":""}]
[27,null,null,null,null,null,null,null,null,null,null,null,null,{"$f":"IF(G46=\"\",\"\",INDEX(名前!$N$4:$N$47,MATCH(申込一覧!G46,名前!$M$4:$M$47,0)))","v":""},{"$f":"IF(I46=\"\",\"\",INDEX(名前!$N$4:$N$47,MATCH(申込一覧!I46,名前!$M$4:$M$47,0)))","v":""},{"$f":"IF(K46=\"\",\"\",INDEX(名前!$N$4:$N$47,MATCH(申込一覧!K46,名前!$M$4:$M$47,0)))","v":""}]
[28,null,null,null,null,null,null,null,null,null,null,null,null,{"$f":"IF(G47=\"\",\"\",INDEX(名前!$N$4:$N$47,MATCH(申込一覧!G47,名前!$M$4:$M$47,0)))","v":""},{"$f":"IF(I47=\"\",\"\",INDEX(名前!$N$4:$N$47,MATCH(申込一覧!I47,名前!$M$4:$M$47,0)))","v":""},{"$f":"IF(K47=\"\",\"\",INDEX(名前!$N$4:$N$47,MATCH(申込一覧!K47,名前!$M$4:$M$47,0)))","v":""}]
[29,null,null,null,null,null,null,null,null,null,null,null,null,{"$f":"IF(G48=\"\",\"\",INDEX(名前!$N$4:$N$47,MATCH(申込一覧!G48,名前!$M$4:$M$47,0)))","v":""},{"$f":"IF(I48=\"\",\"\",INDEX(名前!$N$4:$N$47,MATCH(申込一覧!I48,名前!$M$4:$M$47,0)))","v":""},{"$f":"IF(K48=\"\",\"\",INDEX(名前!$N$4:$N$47,MATCH(申込一覧!K48,名前!$M$4:$M$47,0)))","v":""}]
[30,null,null,null,null,null,null,null,null,null,null,null,null,{"$f":"IF(G49=\"\",\"\",INDEX(名前!$N$4:$N$47,MATCH(申込一覧!G49,名前!$M$4:$M$47,0)))","v":""},{"$f":"IF(I49=\"\",\"\",INDEX(名前!$N$4:$N$47,MATCH(申込一覧!I49,名前!$M$4:$M$47,0)))","v":""},{"$f":"IF(K49=\"\",\"\",INDEX(名前!$N$4:$N$47,MATCH(申込一覧!K49,名前!$M$4:$M$47,0)))","v":""}]
[31,null,null,null,null,null,null,null,null,null,null,null,null,{"$f":"IF(G50=\"\",\"\",INDEX(名前!$N$4:$N$47,MATCH(申込一覧!G50,名前!$M$4:$M$47,0)))","v":""},{"$f":"IF(I50=\"\",\"\",INDEX(名前!$N$4:$N$47,MATCH(申込一覧!I50,名前!$M$4:$M$47,0)))","v":""},{"$f":"IF(K50=\"\",\"\",INDEX(名前!$N$4:$N$47,MATCH(申込一覧!K50,名前!$M$4:$M$47,0)))","v":""}]
[32,null,null,null,null,null,null,null,null,null,null,null,null,{"$f":"IF(G51=\"\",\"\",INDEX(名前!$N$4:$N$47,MATCH(申込一覧!G51,名前!$M$4:$M$47,0)))","v":""},{"$f":"IF(I51=\"\",\"\",INDEX(名前!$N$4:$N$47,MATCH(申込一覧!I51,名前!$M$4:$M$47,0)))","v":""},{"$f":"IF(K51=\"\",\"\",INDEX(名前!$N$4:$N$47,MATCH(申込一覧!K51,名前!$M$4:$M$47,0)))","v":""}]
[33,null,null,null,null,null,null,null,null,null,null,null,null,{"$f":"IF(G52=\"\",\"\",INDEX(名前!$N$4:$N$47,MATCH(申込一覧!G52,名前!$M$4:$M$47,0)))","v":""},{"$f":"IF(I52=\"\",\"\",INDEX(名前!$N$4:$N$47,MATCH(申込一覧!I52,名前!$M$4:$M$47,0)))","v":""},{"$f":"IF(K52=\"\",\"\",INDEX(名前!$N$4:$N$47,MATCH(申込一覧!K52,名前!$M$4:$M$47,0)))","v":""}]
[34,null,null,null,null,null,null,null,null,null,null,null,null,{"$f":"IF(G53=\"\",\"\",INDEX(名前!$N$4:$N$47,MATCH(申込一覧!G53,名前!$M$4:$M$47,0)))","v":""},{"$f":"IF(I53=\"\",\"\",INDEX(名前!$N$4:$N$47,MATCH(申込一覧!I53,名前!$M$4:$M$47,0)))","v":""},{"$f":"IF(K53=\"\",\"\",INDEX(名前!$N$4:$N$47,MATCH(申込一覧!K53,名前!$M$4:$M$47,0)))","v":""}]
[35,null,null,null,null,null,null,null,null,null,null,null,null,{"$f":"IF(G54=\"\",\"\",INDEX(名前!$N$4:$N$47,MATCH(申込一覧!G54,名前!$M$4:$M$47,0)))","v":""},{"$f":"IF(I54=\"\",\"\",INDEX(名前!$N$4:$N$47,MATCH(申込一覧!I54,名前!$M$4:$M$47,0)))","v":""},{"$f":"IF(K54=\"\",\"\",INDEX(名前!$N$4:$N$47,MATCH(申込一覧!K54,名前!$M$4:$M$47,0)))","v":""}]
[36,null,null,null,null,null,null,null,null,null,null,null,null,{"$f":"IF(G55=\"\",\"\",INDEX(名前!$N$4:$N$47,MATCH(申込一覧!G55,名前!$M$4:$M$47,0)))","v":""},{"$f":"IF(I55=\"\",\"\",INDEX(名前!$N$4:$N$47,MATCH(申込一覧!I55,名前!$M$4:$M$47,0)))","v":""},{"$f":"IF(K55=\"\",\"\",INDEX(名前!$N$4:$N$47,MATCH(申込一覧!K55,名前!$M$4:$M$47,0)))","v":""}]
[37,null,null,null,null,null,null,null,null,null,null,null,null,{"$f":"IF(G56=\"\",\"\",INDEX(名前!$N$4:$N$47,MATCH(申込一覧!G56,名前!$M$4:$M$47,0)))","v":""},{"$f":"IF(I56=\"\",\"\",INDEX(名前!$N$4:$N$47,MATCH(申込一覧!I56,名前!$M$4:$M$47,0)))","v":""},{"$f":"IF(K56=\"\",\"\",INDEX(名前!$N$4:$N$47,MATCH(申込一覧!K56,名前!$M$4:$M$47,0)))","v":""}]
[38,null,null,null,null,null,null,null,null,null,null,null,null,{"$f":"IF(G57=\"\",\"\",INDEX(名前!$N$4:$N$47,MATCH(申込一覧!G57,名前!$M$4:$M$47,0)))","v":""},{"$f":"IF(I57=\"\",\"\",INDEX(名前!$N$4:$N$47,MATCH(申込一覧!I57,名前!$M$4:$M$47,0)))","v":""},{"$f":"IF(K57=\"\",\"\",INDEX(名前!$N$4:$N$47,MATCH(申込一覧!K57,名前!$M$4:$M$47,0)))","v":""}]
[39,null,null,null,null,null,null,null,null,null,null,null,null,{"$f":"IF(G58=\"\",\"\",INDEX(名前!$N$4:$N$47,MATCH(申込一覧!G58,名前!$M$4:$M$47,0)))","v":""},{"$f":"IF(I58=\"\",\"\",INDEX(名前!$N$4:$N$47,MATCH(申込一覧!I58,名前!$M$4:$M$47,0)))","v":""},{"$f":"IF(K58=\"\",\"\",INDEX(名前!$N$4:$N$47,MATCH(申込一覧!K58,名前!$M$4:$M$47,0)))","v":""}]
[40,null,null,null,null,null,null,null,null,null,null,null,null,{"$f":"IF(G59=\"\",\"\",INDEX(名前!$N$4:$N$47,MATCH(申込一覧!G59,名前!$M$4:$M$47,0)))","v":""},{"$f":"IF(I59=\"\",\"\",INDEX(名前!$N$4:$N$47,MATCH(申込一覧!I59,名前!$M$4:$M$47,0)))","v":""},{"$f":"IF(K59=\"\",\"\",INDEX(名前!$N$4:$N$47,MATCH(申込一覧!K59,名前!$M$4:$M$47,0)))","v":""}]
[41,null,null,null,null,null,null,null,null,null,null,null,null,{"$f":"IF(G60=\"\",\"\",INDEX(名前!$N$4:$N$47,MATCH(申込一覧!G60,名前!$M$4:$M$47,0)))","v":""},{"$f":"IF(I60=\"\",\"\",INDEX(名前!$N$4:$N$47,MATCH(申込一覧!I60,名前!$M$4:$M$47,0)))","v":""},{"$f":"IF(K60=\"\",\"\",INDEX(名前!$N$4:$N$47,MATCH(申込一覧!K60,名前!$M$4:$M$47,0)))","v":""}]
{"$rows_left_out":40}
{"sheet":"リレー","index":2,"n_rows":10,"n_cols":9,"rows_kept":10,"cut":false,"hidden":true,"merged":[[0,0,0,8],[2,6,2,8],[4,0,4,8],[5,0,5,8],[6,0,6,8]]}
[]
[]
[null,null,null,null,null,null,{"$f":"IF(申込一覧!F11=\"\",\"\",申込一覧!F11)","v":""}]
[]
["注１　選手の欄にナンバーカード（半角数字）を入力してください。"]
["注2　リレーのみの参加選手も【申込一覧】に入力してください。"]
["注3　同種目に複数チーム参加する場合はチーム欄に「 A，B，C，・・・・ 」等をリストより選択してください。"]
["注4　同種目に1チームの場合はチーム欄は空白でお願いします。"]
[]
["種目","チーム","最高記録","選手①","選手②","選手③","選手④","選手⑤","選手⑥"]

{"sheet":"競技者","index":3,"n_rows":2,"n_cols":12,"rows_kept":2,"cut":false,"hidden":false,"merged":[]}
["DB","N1","N2","SX","KC","MC","TL","WT","ZK","S1","S2","S3"]
[{"$f":"IF(申込一覧!B20=\"\",\"\",申込一覧!F20*10000+申込一覧!B20&\"7777\")","v":""},{"$f":"IF(申込一覧!C20=\"\",\"\",申込一覧!C20&IF(申込一覧!E20=\"\",\"\",\"(\"&申込一覧!E20&\")\"))","v":""},{"$f":"IF(申込一覧!D20=\"\",\"\",申込一覧!D20)","v":""},{"$f":"IF(申込一覧!F20=\"\",\"\",申込一覧!F20)","v":""},{"$f":"IF(申込一覧!B20=\"\",\"\",申込一覧!$C$11)","v":""},{"$f":"IF(申込一覧!B20=\"\",\"\",申込一覧!$F$11)","v":""},{"$f":"IF(申込一覧!B20=\"\",\"\",0)","v":""},{"$f":"IF(申込一覧!B20=\"\",\"\",0)","v":""},{"$f":"IF(申込一覧!B20=\"\",\"\",申込一覧!B20)","v":""},{"$f":"IF(申込一覧!G20=\"\",\"\",INDEX(名前!$L$4:$L$47,MATCH(申込一覧!G20,名前!$M$4:$M$47,0))&\" \"&IF(申込一覧!N20=1,RIGHTB(10000000+申込一覧!H20,7),IF(申込一覧!N20=2,RIGHTB(100000+申込一覧!H20,5),\"\")))","v":""},{"$f":"IF(申込一覧!I20=\"\",\"\",INDEX(名前!$L$4:$L$47,MATCH(申込一覧!I20,名前!$M$4:$M$47,0))&\" \"&IF(申込一覧!O20=1,RIGHTB(10000000+申込一覧!J20,7),IF(申込一覧!O20=2,RIGHTB(100000+申込一覧!J20,5),\"\")))","v":""},{"$f":"IF(申込一覧!K20=\"\",\"\",INDEX(名前!$L$4:$L$47,MATCH(申込一覧!K20,名前!$M$4:$M$47,0))&\" \"&IF(申込一覧!P20=1,RIGHTB(10000000+申込一覧!L20,7),IF(申込一覧!P20=2,RIGHTB(100000+申込一覧!L20,5),\"\")))","v":""}]

{"sheet":"ﾘﾚｰDB","index":4,"n_rows":2,"n_cols":12,"rows_kept":2,"cut":false,"hidden":true,"merged":[]}
[null,"DB","ZK","N1","N2","TM","S1","S2","S3","S4","S5","S6"]
[{"$f":"IF(リレー!A11=\"\",\"\",リレー!A11)","v":""},{"$f":"IF(リレー!A11=\"\",\"\",申込一覧!$F$11)&IF(リレー!B11=\"\",\"\",リレー!B11)","v":""},null,{"$f":"IF(リレー!A11=\"\",\"\",申込一覧!$F$11)&IF(リレー!B11=\"\",\"\",リレー!B11)","v":""},null,{"$f":"IF(リレー!C11=\"\",\"\",リレー!C11)","v":""},{"$f":"IF(リレー!D11=\"\",\"\",IF(LEFT($A2,1)=\"男\",10000+リレー!D11&\"7777\",IF(LEFT($A2,1)=\"女\",20000+リレー!D11&\"7777\",\"\")))","v":""},{"$f":"IF(リレー!E11=\"\",\"\",IF(LEFT($A2,1)=\"男\",10000+リレー!E11&\"7777\",IF(LEFT($A2,1)=\"女\",20000+リレー!E11&\"7777\",\"\")))","v":""},{"$f":"IF(リレー!F11=\"\",\"\",IF(LEFT($A2,1)=\"男\",10000+リレー!F11&\"7777\",IF(LEFT($A2,1)=\"女\",20000+リレー!F11&\"7777\",\"\")))","v":""},{"$f":"IF(リレー!G11=\"\",\"\",IF(LEFT($A2,1)=\"男\",10000+リレー!G11&\"7777\",IF(LEFT($A2,1)=\"女\",20000+リレー!G11&\"7777\",\"\")))","v":""},{"$f":"IF(リレー!H11=\"\",\"\",IF(LEFT($A2,1)=\"男\",10000+リレー!H11&\"7777\",IF(LEFT($A2,1)=\"女\",20000+リレー!H11&\"7777\",\"\")))","v":""},{"$f":"IF(リレー!I11=\"\",\"\",IF(LEFT($A2,1)=\"男\",10000+リレー!I11&\"7777\",IF(LEFT($A2,1)=\"女\",20000+リレー!I11&\"7777\",\"\")))","v":""}]

{"sheet":"名前","index":5,"n_rows":50,"n_cols":14,"rows_kept":50,"cut":false,"hidden":false,"merged":[]}
[]
[]
["NO","都道府県名",null,"性別",null,null,"男子",null,null,"女子"]
[1,"北海道",null,1,null,"00273","男小100m3年",null,"00273","女小100m3年",null,"00273","男小100m3年",1]
[2,"青　森",null,2,null,"00274","男小100m4年",null,"00274","女小100m4年",null,"00274","男小100m4年",1]
[3,"岩　手",null,null,null,null,null,null,null,null,null,"00275","男小100m5年",1]
[4,"宮　城",null,null,null,null,null,null,null,null,null,"00276","男小100m6年",1]
[5,"秋　田",null,null,null,null,null,null,null,null,null,"00770","男小1000m",1]
[6,"山　形",null,null,null,null,null,null,null,null,null,"04170","男小80mH",1]
[7,"福　島",null,null,null,null,null,null,null,null,null,"07170","男走高跳",2]
[8,"茨　城",null,null,null,null,null,null,null,null,null,"07370","男走幅跳",2]
[9,"栃　木",null,null,null,null,null,null,null,null,null,"10070","男ｳﾞｫｰﾃｯｸｽ投",2]
[10,"群　馬",null,"リレー",null,null,null,null,null,null,null,"00273","女小100m3年",1]
[11,"埼　玉",null,"男4×100mR",null,null,null,null,null,null,null,"00274","女小100m4年",1]
[12,"千　葉",null,"女4×100mR",null,null,null,null,null,null,null,"00275","女小100m5年",1]
[13,"東　京",null,null,null,null,null,null,null,null,null,"00276","女小100m6年",1]
[14,"神奈川",null,null,null,"種別","個人",null,null,null,null,"00770","女小1000m",1]
[15,"新　潟",null,null,null,"小学",600,null,null,null,null,"04170","女小80mH",1]
[16,"富　山",null,null,null,null,null,null,null,null,null,"07170","女走高跳",2]
[17,"石　川",null,null,null,null,null,null,null,null,null,"07370","女走幅跳",2]
[18,"福　井",null,"Rチーム",null,null,null,null,null,null,null,"10070","女ｳﾞｫｰﾃｯｸｽ投",2]
[19,"山　梨",null,"Ａ"]
[20,"長　野",null,"Ｂ"]
[21,"岐　阜",null,"Ｃ"]
[22,"静　岡",null,"Ｄ"]
[23,"愛　知",null,"Ｅ"]
[24,"三　重",null,"Ｆ"]
[25,"滋　賀",null,"Ｇ"]
[26,"京　都",null,"Ｈ"]
[27,"大　阪",null,"Ｉ"]
[28,"兵　庫",null,"Ｊ"]
[29,"奈　良"]
[30,"和歌山"]
[31,"鳥　取"]
[32,"島　根"]
[33,"岡　山"]
[34,"広　島"]
[35,"山　口"]
[36,"徳　島"]
[37,"香　川"]
[38,"愛　媛"]
[39,"高　知"]
[40,"福　岡"]
[41,"佐　賀"]
[42,"長　崎"]
[43,"熊　本"]
[44,"大　分"]
[45,"宮　崎"]
[46,"鹿児島"]
[47,"沖　縄"]